Reaction Details
TargetCarbonic anhydrase 9
LigandBDBM50147756
Substrate/Competitorn/a
Meas. Tech.ChEMBL_1555889 (CHEMBL3767106)
Ki 5.1±n/a nM
Citation Alafeefy, AMCarta, FCeruso, MAl-Tamimi, AMAl-Kahtani, AASupuran, CT Development of 3-(4-aminosulphonyl)-phenyl-2-mercapto-3H-quinazolin-4-ones as inhibitors of carbonic anhydrase isoforms involved in tumorigenesis and glaucoma. Bioorg Med Chem24:1402-7 (2016) 
 
Carbonic anhydrase 9
Name:Carbonic anhydrase 9
Type:Enzyme
Mol. Mass.:49669.03
Organism:Homo sapiens (Human)
Description:Catalytic domain of human cloned isozyme was used in the assay
Residue:459
BDBM50147756
NameBDBM50147756
Synonyms:CHEMBL3763255
TypeSmall organic molecule
Emp. Form.C15H13N3O4S2
Mol. Mass.363.411
SMILESCOc1cccc2c1nc(S)n(-c1ccc(cc1)S(N)(=O)=O)c2=O