Reaction Details
TargetCarbonic anhydrase 12
LigandBDBM50147736
Substrate/Competitorn/a
Meas. Tech.ChEMBL_1555890 (CHEMBL3767107)
Ki 35±n/a nM
Citation Alafeefy, AMCarta, FCeruso, MAl-Tamimi, AMAl-Kahtani, AASupuran, CT Development of 3-(4-aminosulphonyl)-phenyl-2-mercapto-3H-quinazolin-4-ones as inhibitors of carbonic anhydrase isoforms involved in tumorigenesis and glaucoma. Bioorg Med Chem24:1402-7 (2016) 
 
Carbonic anhydrase 12
Name:Carbonic anhydrase 12
Type:Enzyme
Mol. Mass.:39456.00
Organism:Homo sapiens (Human)
Description:Catalytic domain of human cloned isozyme was used in the assay
Residue:354
BDBM50147736
NameBDBM50147736
Synonyms:CHEMBL3763861
TypeSmall organic molecule
Emp. Form.C14H10ClN3O3S2
Mol. Mass.367.831
SMILESNS(=O)(=O)c1ccc(cc1)-n1c(S)nc2cc(Cl)ccc2c1=O