Reaction Details
TargetCarbonic anhydrase 12
LigandBDBM50147752
Substrate/Competitorn/a
Meas. Tech.ChEMBL_1555890 (CHEMBL3767107)
Ki 0.600000±n/a nM
Citation Alafeefy, AMCarta, FCeruso, MAl-Tamimi, AMAl-Kahtani, AASupuran, CT Development of 3-(4-aminosulphonyl)-phenyl-2-mercapto-3H-quinazolin-4-ones as inhibitors of carbonic anhydrase isoforms involved in tumorigenesis and glaucoma. Bioorg Med Chem24:1402-7 (2016) 
 
Carbonic anhydrase 12
Name:Carbonic anhydrase 12
Type:Enzyme
Mol. Mass.:39456.00
Organism:Homo sapiens (Human)
Description:Catalytic domain of human cloned isozyme was used in the assay
Residue:354
BDBM50147752
NameBDBM50147752
Synonyms:CHEMBL3763877
TypeSmall organic molecule
Emp. Form.C17H17N3O6S2
Mol. Mass.423.463
SMILESCOc1cc2c(nc(S)n(-c3ccc(cc3)S(N)(=O)=O)c2=O)c(OC)c1OC