Reaction Details
TargetPhosphodiesterase
LigandBDBM50148246
Substrate/Competitorn/a
Meas. Tech.ChEMBL_1553554 (CHEMBL3769086)
IC50 1995±n/a nM
Citation Veerman, Jvan den Bergh, TOrrling, KMJansen, CCos, PMaes, LChatelain, EIoset, JREdink, EETenor, HSeebeck, Tde Esch, ILeurs, RSterk, GJ Synthesis and evaluation of analogs of the phenylpyridazinone NPD-001 as potent trypanosomal TbrPDEB1 phosphodiesterase inhibitors and in vitro trypanocidals. Bioorg Med Chem24:1573-81 (2016) 
 
Phosphodiesterase
Name:Phosphodiesterase
Type:Protein
Mol. Mass.:103683.20
Organism:Trypanosoma brucei
Description:n/a
Residue:930
BDBM50148246
NameBDBM50148246
Synonyms:CHEMBL3764415
TypeSmall organic molecule
Emp. Form.C19H26N2O3
Mol. Mass.330.4213
SMILES[H][C@@]12CCCC[C@]1([H])C(=NN(C(C)C)C2=O)c1ccc(OC)c(OC)c1