Reaction Details
TargetPhosphodiesterase
LigandBDBM50148252
Substrate/Competitorn/a
Meas. Tech.ChEMBL_1553554 (CHEMBL3769086)
IC50 100±n/a nM
Citation Veerman, Jvan den Bergh, TOrrling, KMJansen, CCos, PMaes, LChatelain, EIoset, JREdink, EETenor, HSeebeck, Tde Esch, ILeurs, RSterk, GJ Synthesis and evaluation of analogs of the phenylpyridazinone NPD-001 as potent trypanosomal TbrPDEB1 phosphodiesterase inhibitors and in vitro trypanocidals. Bioorg Med Chem24:1573-81 (2016) 
 
Phosphodiesterase
Name:Phosphodiesterase
Type:Protein
Mol. Mass.:103683.20
Organism:Trypanosoma brucei
Description:n/a
Residue:930
BDBM50148252
NameBDBM50148252
Synonyms:CHEMBL3764909
TypeSmall organic molecule
Emp. Form.C28H33N3O3
Mol. Mass.459.5799
SMILES[H][C@@]12CC=CC[C@]1([H])C(=NN(C1CCCCCC1)C2=O)c1ccc(OC)c(OCc2ccccn2)c1