Reaction Details
TargetMu-type opioid receptor
LigandBDBM50148258
Substrate/Competitorn/a
Meas. Tech.ChEMBL_1553558 (CHEMBL3769090)
Ki 106±n/a nM
Citation Adamska, AKluczyk, ACerlesi, MCCalo, GJanecka, ABorics, A Synthesis, biological evaluation and structural analysis of novel peripherally active morphiceptin analogs. Bioorg Med Chem24:1582-8 (2016) 
 
Mu-type opioid receptor
Name:Mu-type opioid receptor
Type:G Protein-Coupled Receptor (GPCR)
Mol. Mass.:44503.11
Organism:Rattus norvegicus (rat)
Description:Competition binding assays were carried out using membrane preparations from transfected HN9.10 cells that constitutively expressed the mu opioid receptor.
Residue:398
BDBM50148258
NameBDBM50148258
Synonyms:CHEMBL3764033
TypeSmall organic molecule
Emp. Form.C28H31F4N5O5
Mol. Mass.593.5699
SMILESN[C@@H](Cc1ccc(O)cc1)C(=O)N1CC(F)(F)C[C@H]1C(=O)N[C@@H](Cc1ccccc1)C(=O)N1CC(F)(F)C[C@H]1C(N)=O