Reaction Details
TargetBromodomain adjacent to zinc finger domain protein 2A
LigandBDBM50148289
Substrate/Competitorn/a
Meas. Tech.ChEMBL_1557666 (CHEMBL3772735)
IC50 160±n/a nM
Citation Chen, PChaikuad, ABamborough, PBantscheff, MBountra, CChung, CWFedorov, OGrandi, PJung, DLesniak, RLindon, MMüller, SPhilpott, MPrinjha, RRogers, CSelenski, CTallant, CWerner, TWillson, TMKnapp, SDrewry, DH Discovery and Characterization of GSK2801, a Selective Chemical Probe for the Bromodomains BAZ2A and BAZ2B. J Med Chem59:1410-24 (2016) 
 
Bromodomain adjacent to zinc finger domain protein 2A
Name:Bromodomain adjacent to zinc finger domain protein 2A
Type:PROTEIN
Mol. Mass.:211197.21
Organism:Homo sapiens (Human)
Description:ChEMBL_108002
Residue:1905
BDBM50148289
NameBDBM50148289
Synonyms:CHEMBL3770199
TypeSmall organic molecule
Emp. Form.C23H26N2O5S
Mol. Mass.442.528
SMILESCC(=O)c1cc(-c2ccccc2S(C)(=O)=O)c2cc(CNC(=O)OC(C)(C)C)ccn12