Reaction Details
TargetTranscription intermediary factor 1-alpha
LigandBDBM50148474
Substrate/Competitorn/a
Meas. Tech.ChEMBL_1558044 (CHEMBL3771488)
IC50 1270±n/a nM
Citation Bennett, JFedorov, OTallant, CMonteiro, OMeier, JGamble, VSavitsky, PNunez-Alonso, GAHaendler, BRogers, CBrennan, PEMüller, SKnapp, S Discovery of a Chemical Tool Inhibitor Targeting the Bromodomains of TRIM24 and BRPF. J Med Chem59:1642-7 (2016) 
 
Transcription intermediary factor 1-alpha
Name:Transcription intermediary factor 1-alpha
Type:PROTEIN
Mol. Mass.:116839.55
Organism:Homo sapiens (Human)
Description:ChEMBL_107998
Residue:1050
BDBM50148474
NameBDBM50148474
Synonyms:CHEMBL3771226
TypeSmall organic molecule
Emp. Form.C22H21N3O4S
Mol. Mass.423.485
SMILESCc1ccc(cc1)S(=O)(=O)Nc1cc2n(C)c(=O)n(C)c2cc1Oc1ccccc1