Reaction Details
TargetTranscription intermediary factor 1-alpha
LigandBDBM50148476
Substrate/Competitorn/a
Meas. Tech.ChEMBL_1558044 (CHEMBL3771488)
IC50 2380±n/a nM
Citation Bennett, JFedorov, OTallant, CMonteiro, OMeier, JGamble, VSavitsky, PNunez-Alonso, GAHaendler, BRogers, CBrennan, PEMüller, SKnapp, S Discovery of a Chemical Tool Inhibitor Targeting the Bromodomains of TRIM24 and BRPF. J Med Chem59:1642-7 (2016) 
 
Transcription intermediary factor 1-alpha
Name:Transcription intermediary factor 1-alpha
Type:PROTEIN
Mol. Mass.:116839.55
Organism:Homo sapiens (Human)
Description:ChEMBL_107998
Residue:1050
BDBM50148476
NameBDBM50148476
Synonyms:CHEMBL3770391
TypeSmall organic molecule
Emp. Form.C22H21N3O5S
Mol. Mass.439.484
SMILESCOc1cccc(c1)S(=O)(=O)Nc1cc2n(C)c(=O)n(C)c2cc1Oc1ccccc1