Reaction Details
TargetTranscription intermediary factor 1-alpha
LigandBDBM50148481
Substrate/Competitorn/a
Meas. Tech.ChEMBL_1558044 (CHEMBL3771488)
IC50 1470±n/a nM
Citation Bennett, JFedorov, OTallant, CMonteiro, OMeier, JGamble, VSavitsky, PNunez-Alonso, GAHaendler, BRogers, CBrennan, PEMüller, SKnapp, S Discovery of a Chemical Tool Inhibitor Targeting the Bromodomains of TRIM24 and BRPF. J Med Chem59:1642-7 (2016) 
 
Transcription intermediary factor 1-alpha
Name:Transcription intermediary factor 1-alpha
Type:PROTEIN
Mol. Mass.:116839.55
Organism:Homo sapiens (Human)
Description:ChEMBL_107998
Residue:1050
BDBM50148481
NameBDBM50148481
Synonyms:CHEMBL3771005
TypeSmall organic molecule
Emp. Form.C23H23N3O5S
Mol. Mass.453.511
SMILESCOc1ccc(Oc2cc3n(C)c(=O)n(C)c3cc2NS(=O)(=O)c2ccccc2C)cc1