Reaction Details
TargetPeregrin
LigandBDBM50148466
Substrate/Competitorn/a
Meas. Tech.ChEMBL_1558045 (CHEMBL3771489)
IC50 1400±n/a nM
Citation Bennett, JFedorov, OTallant, CMonteiro, OMeier, JGamble, VSavitsky, PNunez-Alonso, GAHaendler, BRogers, CBrennan, PEMüller, SKnapp, S Discovery of a Chemical Tool Inhibitor Targeting the Bromodomains of TRIM24 and BRPF. J Med Chem59:1642-7 (2016) 
 
Peregrin
Name:Peregrin
Type:PROTEIN
Mol. Mass.:137524.47
Organism:Homo sapiens (Human)
Description:ChEMBL_108054
Residue:1214
BDBM50148466
NameBDBM50148466
Synonyms:CHEMBL3771239
TypeSmall organic molecule
Emp. Form.C21H25N3O7S
Mol. Mass.463.504
SMILESCO[C@@]1(C)Oc2ccc(cc2OC1(C)OC)S(=O)(=O)Nc1ccc2n(C)c(=O)n(C)c2c1