Reaction Details
TargetPeregrin
LigandBDBM50148549
Substrate/Competitorn/a
Meas. Tech.ChEMBL_1558045 (CHEMBL3771489)
IC50 270±n/a nM
Citation Bennett, JFedorov, OTallant, CMonteiro, OMeier, JGamble, VSavitsky, PNunez-Alonso, GAHaendler, BRogers, CBrennan, PEMüller, SKnapp, S Discovery of a Chemical Tool Inhibitor Targeting the Bromodomains of TRIM24 and BRPF. J Med Chem59:1642-7 (2016) 
 
Peregrin
Name:Peregrin
Type:PROTEIN
Mol. Mass.:137524.47
Organism:Homo sapiens (Human)
Description:ChEMBL_108054
Residue:1214
BDBM50148549
NameBDBM50148549
Synonyms:4-Bromo-N-(2,3-dihydro-6-methoxy-1,3-dimethyl-2-oxo-1H-benzimidazol-5-yl)-2-methyl-benzenesulfonamide CHEMBL3770173 OF-1
TypeSmall organic molecule
Emp. Form.C17H18BrN3O4S
Mol. Mass.440.312
SMILESCOc1cc2n(C)c(=O)n(C)c2cc1NS(=O)(=O)c1ccc(Br)cc1C