Reaction Details
TargetPeregrin
LigandBDBM50148481
Substrate/Competitorn/a
Meas. Tech.ChEMBL_1558045 (CHEMBL3771489)
IC50 680±n/a nM
Citation Bennett, JFedorov, OTallant, CMonteiro, OMeier, JGamble, VSavitsky, PNunez-Alonso, GAHaendler, BRogers, CBrennan, PEMüller, SKnapp, S Discovery of a Chemical Tool Inhibitor Targeting the Bromodomains of TRIM24 and BRPF. J Med Chem59:1642-7 (2016) 
 
Peregrin
Name:Peregrin
Type:PROTEIN
Mol. Mass.:137524.47
Organism:Homo sapiens (Human)
Description:ChEMBL_108054
Residue:1214
BDBM50148481
NameBDBM50148481
Synonyms:CHEMBL3771005
TypeSmall organic molecule
Emp. Form.C23H23N3O5S
Mol. Mass.453.511
SMILESCOc1ccc(Oc2cc3n(C)c(=O)n(C)c3cc2NS(=O)(=O)c2ccccc2C)cc1