Reaction Details
TargetBromodomain-containing protein 1
LigandBDBM50148460
Substrate/Competitorn/a
Meas. Tech.ChEMBL_1558046 (CHEMBL3771490)
IC50 2050±n/a nM
Citation Bennett, JFedorov, OTallant, CMonteiro, OMeier, JGamble, VSavitsky, PNunez-Alonso, GAHaendler, BRogers, CBrennan, PEMüller, SKnapp, S Discovery of a Chemical Tool Inhibitor Targeting the Bromodomains of TRIM24 and BRPF. J Med Chem59:1642-7 (2016) 
 
Bromodomain-containing protein 1
Name:Bromodomain-containing protein 1
Type:PROTEIN
Mol. Mass.:119557.65
Organism:Homo sapiens (Human)
Description:ChEMBL_105349
Residue:1058
BDBM50148460
NameBDBM50148460
Synonyms:CHEMBL1346130
TypeSmall organic molecule
Emp. Form.C19H21N3O3S
Mol. Mass.371.453
SMILESCn1c2ccc(NS(=O)(=O)c3ccc4CCCCc4c3)cc2n(C)c1=O