Reaction Details
TargetBromodomain-containing protein 1
LigandBDBM50148461
Substrate/Competitorn/a
Meas. Tech.ChEMBL_1558046 (CHEMBL3771490)
IC50 6140±n/a nM
Citation Bennett, JFedorov, OTallant, CMonteiro, OMeier, JGamble, VSavitsky, PNunez-Alonso, GAHaendler, BRogers, CBrennan, PEMüller, SKnapp, S Discovery of a Chemical Tool Inhibitor Targeting the Bromodomains of TRIM24 and BRPF. J Med Chem59:1642-7 (2016) 
 
Bromodomain-containing protein 1
Name:Bromodomain-containing protein 1
Type:PROTEIN
Mol. Mass.:119557.65
Organism:Homo sapiens (Human)
Description:ChEMBL_105349
Residue:1058
BDBM50148461
NameBDBM50148461
Synonyms:CHEMBL3770652
TypeSmall organic molecule
Emp. Form.C16H16FN3O3S
Mol. Mass.349.38
SMILESCc1ccc(cc1F)S(=O)(=O)Nc1ccc2n(C)c(=O)n(C)c2c1