Reaction Details
TargetOrexin/Hypocretin receptor type 1
LigandBDBM50148575
Substrate/Competitorn/a
Meas. Tech.ChEMBL_1558175 (CHEMBL3772019)
Ki 0.300000±n/a nM
Citation Roecker, AJCox, CDColeman, PJ Orexin Receptor Antagonists: New Therapeutic Agents for the Treatment of Insomnia. J Med Chem59:504-30 (2016) 
 
Orexin/Hypocretin receptor type 1
Name:Orexin/Hypocretin receptor type 1
Type:Protein
Mol. Mass.:47554.50
Organism:Homo sapiens (Human)
Description:O43613
Residue:425
BDBM50148575
NameBDBM50148575
Synonyms:CHEMBL3770503
TypeSmall organic molecule
Emp. Form.C24H27FN4O2
Mol. Mass.422.4952
SMILESC[C@@H]1CC[C@@H](COc2ccc(F)c(C)c2)CN1C(=O)c1cc(C)ccc1-n1nccn1