Reaction Details
TargetOrexin receptor type 2
LigandBDBM104692
Substrate/Competitorn/a
Meas. Tech.ChEMBL_1558189 (CHEMBL3772033)
IC50 11±n/a nM
Citation Roecker, AJCox, CDColeman, PJ Orexin Receptor Antagonists: New Therapeutic Agents for the Treatment of Insomnia. J Med Chem59:504-30 (2016) 
 
Orexin receptor type 2
Name:Orexin receptor type 2
Type:Protein
Mol. Mass.:50710.53
Organism:Homo sapiens (Human)
Description:O43614
Residue:444
BDBM104692
NameBDBM104692
Synonyms:US8569311, E-5
TypeSmall organic molecule
Emp. Form.C24H25FN4O2
Mol. Mass.420.4793
SMILESC[C@@H]1CC[C@@H](COc2ccc(F)cn2)CN1C(=O)c1cc(C)ccc1-c1ncccn1