Reaction Details
TargetOrexin/Hypocretin receptor type 1
LigandBDBM50108620
Substrate/Competitorn/a
Meas. Tech.ChEMBL_1558175 (CHEMBL3772019)
Ki 0.060000±n/a nM
Citation Roecker, AJCox, CDColeman, PJ Orexin Receptor Antagonists: New Therapeutic Agents for the Treatment of Insomnia. J Med Chem59:504-30 (2016) 
 
Orexin/Hypocretin receptor type 1
Name:Orexin/Hypocretin receptor type 1
Type:Protein
Mol. Mass.:47554.50
Organism:Homo sapiens (Human)
Description:O43613
Residue:425
BDBM50108620
NameBDBM50108620
Synonyms:CHEMBL3597953
TypeSmall organic molecule
Emp. Form.C24H25FN2O2S
Mol. Mass.424.531
SMILESCc1nc(C(=O)N2CCCC[C@H]2CCOc2ccc(F)cc2)c(s1)-c1ccccc1