Reaction Details
TargetAdenosine receptor A3
LigandBDBM50148580
Substrate/Competitorn/a
Meas. Tech.ChEMBL_1556374 (CHEMBL3772105)
Ki 25±n/a nM
Citation Donegan, RKLieberman, RL Discovery of Molecular Therapeutics for Glaucoma: Challenges, Successes, and Promising Directions. J Med Chem59:788-809 (2016) 
 
Adenosine receptor A3
Name:Adenosine receptor A3
Type:G Protein-Coupled Receptor (GPCR)
Mol. Mass.:36197.32
Organism:Homo sapiens (Human)
Description:P0DMS8
Residue:318
BDBM50148580
NameBDBM50148580
Synonyms:CHEMBL3770601
TypeSmall organic molecule
Emp. Form.C12H18N6O3
Mol. Mass.294.3097
SMILESCCNC[C@H]1O[C@H]([C@H](O)[C@@H]1O)n1cnc2c(N)ncnc12