Reaction Details
TargetTransmembrane domain-containing protein TMIGD3
LigandBDBM50148600
Substrate/Competitorn/a
Meas. Tech.ChEMBL_1556379 (CHEMBL3772110)
Ki 108±n/a nM
Citation Donegan, RKLieberman, RL Discovery of Molecular Therapeutics for Glaucoma: Challenges, Successes, and Promising Directions. J Med Chem59:788-809 (2016) 
 
Transmembrane domain-containing protein TMIGD3
Name:Transmembrane domain-containing protein TMIGD3
Type:PROTEIN
Mol. Mass.:30335.79
Organism:Homo sapiens (Human)
Description:ChEMBL_114868
Residue:266
BDBM50148600
NameBDBM50148600
Synonyms:CHEMBL3770003
TypeSmall organic molecule
Emp. Form.C26H27NO4
Mol. Mass.417.4969
SMILESCCOC(=O)C1=C(C)NC(=C(C1\C=C\c1ccccc1)C(=O)OCC)c1ccccc1