Reaction Details
TargetHistone deacetylase 8
LigandBDBM50380399
Substrate/Competitorn/a
Meas. Tech.ChEMBL_1556993 (CHEMBL3772324)
IC50 2340±n/a nM
Citation Reddy, DNBallante, FChuang, TPirolli, AMarrocco, BMarshall, GR Design and Synthesis of Simplified Largazole Analogues as Isoform-Selective Human Lysine Deacetylase Inhibitors. J Med Chem59:1613-33 (2016) 
 
Histone deacetylase 8
Name:Histone deacetylase 8
Type:Enzyme
Mol. Mass.:41749.60
Organism:Homo sapiens (Human)
Description:Q9BY41
Residue:377
BDBM50380399
NameBDBM50380399
Synonyms:CHEMBL2018302 US10227295, Compound Tubastatin A US11207431, Example D US9249087, Tubacin US9956192, Compound Tubastatin-A
TypeSmall organic molecule
Emp. Form.C20H21N3O2
Mol. Mass.335.3996
SMILESCN1CCc2c(C1)c1ccccc1n2Cc1ccc(cc1)C(=O)NO