Reaction Details
TargetHistone deacetylase 3
LigandBDBM50005711
Substrate/Competitorn/a
Meas. Tech.ChEMBL_1556988 (CHEMBL3772319)
IC50 20±n/a nM
Citation Reddy, DNBallante, FChuang, TPirolli, AMarrocco, BMarshall, GR Design and Synthesis of Simplified Largazole Analogues as Isoform-Selective Human Lysine Deacetylase Inhibitors. J Med Chem59:1613-33 (2016) 
 
Histone deacetylase 3
Name:Histone deacetylase 3
Type:Enzyme
Mol. Mass.:48829.55
Organism:Homo sapiens (Human)
Description:O15379
Residue:428
BDBM50005711
NameBDBM50005711
Synonyms:CHEBI:46024 TRICHOSTATIN Trichostatin A (TSA) US10722597, Compound Trichostatin US20230322747, Compound trichostatin A | US9265734, TSA
TypeSmall organic molecule
Emp. Form.C17H22N2O3
Mol. Mass.302.3682
SMILESC[C@H](\C=C(/C)\C=C\C(=O)NO)C(=O)c1ccc(cc1)N(C)C