Reaction Details
TargetHistone deacetylase 3
LigandBDBM50121210
Substrate/Competitorn/a
Meas. Tech.ChEMBL_1556984 (CHEMBL3772315)
IC50 3940±n/a nM
Citation Reddy, DNBallante, FChuang, TPirolli, AMarrocco, BMarshall, GR Design and Synthesis of Simplified Largazole Analogues as Isoform-Selective Human Lysine Deacetylase Inhibitors. J Med Chem59:1613-33 (2016) 
 
Histone deacetylase 3
Name:Histone deacetylase 3
Type:Enzyme
Mol. Mass.:48829.55
Organism:Homo sapiens (Human)
Description:O15379
Residue:428
BDBM50121210
NameBDBM50121210
Synonyms:CHEMBL3622374
TypeSmall organic molecule
Emp. Form.C21H19N5OS
Mol. Mass.389.473
SMILESNc1ccccc1NC(=O)c1ccc(cc1)-c1cn(CCc2ccsc2)nn1