Reaction Details
TargetHistone deacetylase 8
LigandBDBM50148630
Substrate/Competitorn/a
Meas. Tech.ChEMBL_1556982 (CHEMBL3772313)
IC50>30000±n/a nM
Citation Reddy, DNBallante, FChuang, TPirolli, AMarrocco, BMarshall, GR Design and Synthesis of Simplified Largazole Analogues as Isoform-Selective Human Lysine Deacetylase Inhibitors. J Med Chem59:1613-33 (2016) 
 
Histone deacetylase 8
Name:Histone deacetylase 8
Type:Enzyme
Mol. Mass.:41749.60
Organism:Homo sapiens (Human)
Description:Q9BY41
Residue:377
BDBM50148630
NameBDBM50148630
Synonyms:CHEMBL3771206
TypeSmall organic molecule
Emp. Form.C26H33N3O5S2
Mol. Mass.531.687
SMILESCC(C)[C@@H]1NC(=O)[C@]2(C)CSC(=N2)c2ccc(CNC(=O)C[C@H](OC1=O)\C=C\CCSC(C)=O)cc2