Reaction Details
TargetHistone deacetylase 8
LigandBDBM19149
Substrate/Competitorn/a
Meas. Tech.ChEMBL_1556982 (CHEMBL3772313)
IC50 500±n/a nM
Citation Reddy, DNBallante, FChuang, TPirolli, AMarrocco, BMarshall, GR Design and Synthesis of Simplified Largazole Analogues as Isoform-Selective Human Lysine Deacetylase Inhibitors. J Med Chem59:1613-33 (2016) 
 
Histone deacetylase 8
Name:Histone deacetylase 8
Type:Enzyme
Mol. Mass.:41749.60
Organism:Homo sapiens (Human)
Description:Q9BY41
Residue:377
BDBM19149
NameBDBM19149
Synonyms:CHEMBL98 SAHA US10188756, Compound SAHA US11505523, Compound SAHA US9353061, SAHA US9695181, Vorinostat Zolinza suberoylanilide hydroxamic acid
TypeSmall organic molecule
Emp. Form.C14H20N2O3
Mol. Mass.264.3202
SMILESONC(=O)CCCCCCC(=O)Nc1ccccc1