Reaction Details
TargetMuscarinic acetylcholine receptor M5
LigandBDBM50148852
Substrate/Competitorn/a
Meas. Tech.ChEMBL_1557341 (CHEMBL3774025)
Ki 2818±n/a nM
Citation Cheng, JGiguere, PMSchmerberg, CMPogorelov, VMRodriguiz, RMHuang, XPZhu, HMcCorvy, JDWetsel, WCRoth, BLKozikowski, AP Further Advances in Optimizing (2-Phenylcyclopropyl)methylamines as Novel Serotonin 2C Agonists: Effects on Hyperlocomotion, Prepulse Inhibition, and Cognition Models. J Med Chem59:578-91 (2016) 
 
Muscarinic acetylcholine receptor M5
Name:Muscarinic acetylcholine receptor M5
Type:PROTEIN
Mol. Mass.:60102.35
Organism:Homo sapiens (Human)
Description:ChEMBL_1517990
Residue:532
BDBM50148852
NameBDBM50148852
Synonyms:CHEMBL3769968
TypeSmall organic molecule
Emp. Form.C13H16ClF2NO
Mol. Mass.275.722
SMILESCl.NCC1CC1c1cc(F)c(F)cc1OCC=C