Reaction Details
TargetAlpha-2A adrenergic receptor
LigandBDBM50148852
Substrate/Competitorn/a
Meas. Tech.ChEMBL_1557336 (CHEMBL3774020)
Ki 165±n/a nM
Citation Cheng, JGiguere, PMSchmerberg, CMPogorelov, VMRodriguiz, RMHuang, XPZhu, HMcCorvy, JDWetsel, WCRoth, BLKozikowski, AP Further Advances in Optimizing (2-Phenylcyclopropyl)methylamines as Novel Serotonin 2C Agonists: Effects on Hyperlocomotion, Prepulse Inhibition, and Cognition Models. J Med Chem59:578-91 (2016) 
 
Alpha-2A adrenergic receptor
Name:Alpha-2A adrenergic receptor
Type:Enzyme
Mol. Mass.:48979.91
Organism:Homo sapiens (Human)
Description:P08913
Residue:465
BDBM50148852
NameBDBM50148852
Synonyms:CHEMBL3769968
TypeSmall organic molecule
Emp. Form.C13H16ClF2NO
Mol. Mass.275.722
SMILESCl.NCC1CC1c1cc(F)c(F)cc1OCC=C