Reaction Details
TargetBeta-2 adrenergic receptor
LigandBDBM50148852
Substrate/Competitorn/a
Meas. Tech.ChEMBL_1557339 (CHEMBL3774023)
Ki 807±n/a nM
Citation Cheng, JGiguere, PMSchmerberg, CMPogorelov, VMRodriguiz, RMHuang, XPZhu, HMcCorvy, JDWetsel, WCRoth, BLKozikowski, AP Further Advances in Optimizing (2-Phenylcyclopropyl)methylamines as Novel Serotonin 2C Agonists: Effects on Hyperlocomotion, Prepulse Inhibition, and Cognition Models. J Med Chem59:578-91 (2016) 
 
Beta-2 adrenergic receptor
Name:Beta-2 adrenergic receptor
Type:n/a
Mol. Mass.:46461.69
Organism:Homo sapiens (Human)
Description:P07550
Residue:413
BDBM50148852
NameBDBM50148852
Synonyms:CHEMBL3769968
TypeSmall organic molecule
Emp. Form.C13H16ClF2NO
Mol. Mass.275.722
SMILESCl.NCC1CC1c1cc(F)c(F)cc1OCC=C