Reaction Details
TargetInduced myeloid leukemia cell differentiation protein Mcl-1
LigandBDBM50148862
Substrate/Competitorn/a
Meas. Tech.ChEMBL_1557446 (CHEMBL3771643)
Ki<7.0±n/a nM
Citation Abdel-Magid, AF Inhibitors of the Antiapoptotic Myeloid Cell Leukemia-1 (Mcl-1) May Provide Effective Treatment for Cancer. ACS Med Chem Lett6:1171-3 (2015) 
 
Induced myeloid leukemia cell differentiation protein Mcl-1
Name:Induced myeloid leukemia cell differentiation protein Mcl-1
Type:Membrane; Single-pass membrane protein
Mol. Mass.:37332.87
Organism:Homo sapiens (Human)
Description:Q07820
Residue:350
BDBM50148862
NameBDBM50148862
Synonyms:CHEMBL3771322 US11208415, Example I-280
TypeSmall organic molecule
Emp. Form.C33H34ClN5O4
Mol. Mass.600.107
SMILESCc1nn(C)c(C)c1-c1cccc2c(CCCOc3cc(C)c(Cl)c(C)c3)c([nH]c12)C(=O)NCc1cc(ccn1)C(O)=O