Reaction Details
TargetKappa-type opioid receptor
LigandBDBM50148869
Substrate/Competitorn/a
Meas. Tech.ChEMBL_1557471 (CHEMBL3771802)
EC50 1200±n/a nM
Citation Bender, AMGriggs, NWGao, CTrask, TJTraynor, JRMosberg, HI Rapid Synthesis of Boc-2',6'-dimethyl-l-tyrosine and Derivatives and Incorporation into Opioid Peptidomimetics. ACS Med Chem Lett6:1199-203 (2015) 
 
Kappa-type opioid receptor
Name:Kappa-type opioid receptor
Type:G Protein-Coupled Receptor (GPCR)
Mol. Mass.:42648.76
Organism:Homo sapiens (Human)
Description:P41145
Residue:380
BDBM50148869
NameBDBM50148869
Synonyms:CHEMBL3770643
TypeSmall organic molecule
Emp. Form.C25H25Cl2N3O2
Mol. Mass.470.391
SMILESN[C@@H](Cc1c(Cl)cc(O)cc1Cl)C(=O)N[C@@H]1CCNc2ccc(Cc3ccccc3)cc12