Reaction Details
TargetKappa-type opioid receptor
LigandBDBM50148909
Substrate/Competitorn/a
Meas. Tech.ChEMBL_1557471 (CHEMBL3771802)
EC50 370±n/a nM
Citation Bender, AMGriggs, NWGao, CTrask, TJTraynor, JRMosberg, HI Rapid Synthesis of Boc-2',6'-dimethyl-l-tyrosine and Derivatives and Incorporation into Opioid Peptidomimetics. ACS Med Chem Lett6:1199-203 (2015) 
 
Kappa-type opioid receptor
Name:Kappa-type opioid receptor
Type:G Protein-Coupled Receptor (GPCR)
Mol. Mass.:42648.76
Organism:Homo sapiens (Human)
Description:P41145
Residue:380
BDBM50148909
NameBDBM50148909
Synonyms:CHEMBL3770677
TypeSmall organic molecule
Emp. Form.C27H31N3O2
Mol. Mass.429.5539
SMILESCc1cc(C[C@H](N)C(=O)N[C@@H]2CCNc3ccc(Cc4ccccc4)cc23)c(C)cc1O