Reaction Details
TargetSerine/threonine-protein kinase PAK 1
LigandBDBM50148922
Substrate/Competitorn/a
Meas. Tech.ChEMBL_1557608 (CHEMBL3772525)
Ki 8.0±n/a nM
Citation Ndubaku, COCrawford, JJDrobnick, JAliagas, ICampbell, DDong, PDornan, LMDuron, SEpler, JGazzard, LHeise, CEHoeflich, KPJakubiak, DLa, HLee, WLin, BLyssikatos, JPMaksimoska, JMarmorstein, RMurray, LJO'Brien, TOh, ARamaswamy, SWang, WZhao, XZhong, YBlackwood, ERudolph, J Design of Selective PAK1 Inhibitor G-5555: Improving Properties by Employing an Unorthodox Low-pK a Polar Moiety. ACS Med Chem Lett6:1241-6 (2015) 
 
Serine/threonine-protein kinase PAK 1
Name:Serine/threonine-protein kinase PAK 1
Type:n/a
Mol. Mass.:60640.15
Organism:Homo sapiens (Human)
Description:Q13153
Residue:545
BDBM50148922
NameBDBM50148922
Synonyms:CHEMBL3770295
TypeSmall organic molecule
Emp. Form.C25H26ClN7O3
Mol. Mass.507.972
SMILESCCNc1ncc2cc(-c3ccc(cc3Cl)-c3cncc(C)n3)c(=O)n(C[C@H]3OC[C@H](N)CO3)c2n1