Reaction Details
TargetSerine/threonine-protein kinase PAK 1
LigandBDBM50148931
Substrate/Competitorn/a
Meas. Tech.ChEMBL_1557608 (CHEMBL3772525)
Ki 22±n/a nM
Citation Ndubaku, COCrawford, JJDrobnick, JAliagas, ICampbell, DDong, PDornan, LMDuron, SEpler, JGazzard, LHeise, CEHoeflich, KPJakubiak, DLa, HLee, WLin, BLyssikatos, JPMaksimoska, JMarmorstein, RMurray, LJO'Brien, TOh, ARamaswamy, SWang, WZhao, XZhong, YBlackwood, ERudolph, J Design of Selective PAK1 Inhibitor G-5555: Improving Properties by Employing an Unorthodox Low-pK a Polar Moiety. ACS Med Chem Lett6:1241-6 (2015) 
 
Serine/threonine-protein kinase PAK 1
Name:Serine/threonine-protein kinase PAK 1
Type:n/a
Mol. Mass.:60640.15
Organism:Homo sapiens (Human)
Description:Q13153
Residue:545
BDBM50148931
NameBDBM50148931
Synonyms:CHEMBL3770186
TypeSmall organic molecule
Emp. Form.C28H32ClN7O
Mol. Mass.518.053
SMILESCCn1c2nc(NCCC3CCN(C)CC3)ncc2cc(-c2ccc(cc2Cl)-c2cncc(C)n2)c1=O