Reaction Details
TargetSerine/threonine-protein kinase PAK 2
LigandBDBM50148921
Substrate/Competitorn/a
Meas. Tech.ChEMBL_1557615 (CHEMBL3772532)
IC50 11±n/a nM
Citation Ndubaku, COCrawford, JJDrobnick, JAliagas, ICampbell, DDong, PDornan, LMDuron, SEpler, JGazzard, LHeise, CEHoeflich, KPJakubiak, DLa, HLee, WLin, BLyssikatos, JPMaksimoska, JMarmorstein, RMurray, LJO'Brien, TOh, ARamaswamy, SWang, WZhao, XZhong, YBlackwood, ERudolph, J Design of Selective PAK1 Inhibitor G-5555: Improving Properties by Employing an Unorthodox Low-pK a Polar Moiety. ACS Med Chem Lett6:1241-6 (2015) 
 
Serine/threonine-protein kinase PAK 2
Name:Serine/threonine-protein kinase PAK 2
Type:Enzyme
Mol. Mass.:58037.40
Organism:Homo sapiens (Human)
Description:Q13177
Residue:524
BDBM50148921
NameBDBM50148921
Synonyms:CHEMBL3770443
TypeSmall organic molecule
Emp. Form.C25H25ClN6O3
Mol. Mass.492.957
SMILESCNc1ncc2cc(-c3ccc(cc3Cl)-c3cccc(C)n3)c(=O)n(C[C@H]3OC[C@H](N)CO3)c2n1