Reaction Details
TargetPhosphatidylinositol 4,5-bisphosphate 3-kinase catalytic subunit alpha isoform
LigandBDBM50149055
Substrate/Competitorn/a
Meas. Tech.ChEMBL_1557706 (CHEMBL3772924)
IC50 33±n/a nM
Citation Peng, WTu, ZCLong, ZJLiu, QLu, G Discovery of 2-(2-aminopyrimidin-5-yl)-4-morpholino-N-(pyridin-3-yl)quinazolin-7-amines as novel PI3K/mTOR inhibitors and anticancer agents. Eur J Med Chem108:644-54 (2016) 
 
Phosphatidylinositol 4,5-bisphosphate 3-kinase catalytic subunit alpha isoform
Name:Phosphatidylinositol 4,5-bisphosphate 3-kinase catalytic subunit alpha isoform
Type:Enzyme Subunit
Mol. Mass.:124294.87
Organism:Homo sapiens (Human)
Description:P42336
Residue:1068
BDBM50149055
NameBDBM50149055
Synonyms:CHEMBL3771347
TypeSmall organic molecule
Emp. Form.C22H20N8O2
Mol. Mass.428.4466
SMILESNc1ncc(cn1)-c1nc(N2CCOCC2)c2ccc(NC(=O)c3cccnc3)cc2n1