Reaction Details
TargetPhosphatidylinositol 4,5-bisphosphate 3-kinase catalytic subunit alpha isoform
LigandBDBM50149209
Substrate/Competitorn/a
Meas. Tech.ChEBML_1557711
IC50>10000±n/a nM
Citation Peng, WTu, ZCLong, ZJLiu, QLu, G Discovery of 2-(2-aminopyrimidin-5-yl)-4-morpholino-N-(pyridin-3-yl)quinazolin-7-amines as novel PI3K/mTOR inhibitors and anticancer agents. Eur J Med Chem108:644-54 (2016) 
 
Phosphatidylinositol 4,5-bisphosphate 3-kinase catalytic subunit alpha isoform
Name:Phosphatidylinositol 4,5-bisphosphate 3-kinase catalytic subunit alpha isoform
Type:Enzyme Subunit
Mol. Mass.:124294.87
Organism:Homo sapiens (Human)
Description:P42336
Residue:1068
BDBM50149209
NameBDBM50149209
Synonyms:CHEMBL3771166
TypeSmall organic molecule
Emp. Form.C22H20N8O3
Mol. Mass.444.446
SMILESNc1ncc(cn1)-c1nc(N2CCOCC2)c2cccc(Nc3ccc(cc3)[N+]([O-])=O)c2n1