Reaction Details
TargetPhosphatidylinositol 4,5-bisphosphate 3-kinase catalytic subunit alpha isoform
LigandBDBM50149047
Substrate/Competitorn/a
Meas. Tech.ChEBML_1557711
IC50 232±n/a nM
Citation Peng, WTu, ZCLong, ZJLiu, QLu, G Discovery of 2-(2-aminopyrimidin-5-yl)-4-morpholino-N-(pyridin-3-yl)quinazolin-7-amines as novel PI3K/mTOR inhibitors and anticancer agents. Eur J Med Chem108:644-54 (2016) 
 
Phosphatidylinositol 4,5-bisphosphate 3-kinase catalytic subunit alpha isoform
Name:Phosphatidylinositol 4,5-bisphosphate 3-kinase catalytic subunit alpha isoform
Type:Enzyme Subunit
Mol. Mass.:124294.87
Organism:Homo sapiens (Human)
Description:P42336
Residue:1068
BDBM50149047
NameBDBM50149047
Synonyms:CHEMBL3770469
TypeSmall organic molecule
Emp. Form.C23H20F3N7O
Mol. Mass.467.4464
SMILESNc1cc(c(cn1)-c1nc(N2CCOCC2)c2ccc(Nc3cccnc3)cc2n1)C(F)(F)F