Reaction Details
TargetPhosphatidylinositol 4,5-bisphosphate 3-kinase catalytic subunit alpha isoform
LigandBDBM50149153
Substrate/Competitorn/a
Meas. Tech.ChEMBL_1557706 (CHEMBL3772924)
IC50 31±n/a nM
Citation Peng, WTu, ZCLong, ZJLiu, QLu, G Discovery of 2-(2-aminopyrimidin-5-yl)-4-morpholino-N-(pyridin-3-yl)quinazolin-7-amines as novel PI3K/mTOR inhibitors and anticancer agents. Eur J Med Chem108:644-54 (2016) 
 
Phosphatidylinositol 4,5-bisphosphate 3-kinase catalytic subunit alpha isoform
Name:Phosphatidylinositol 4,5-bisphosphate 3-kinase catalytic subunit alpha isoform
Type:Enzyme Subunit
Mol. Mass.:124294.87
Organism:Homo sapiens (Human)
Description:P42336
Residue:1068
BDBM50149153
NameBDBM50149153
Synonyms:CHEMBL3769845
TypeSmall organic molecule
Emp. Form.C21H20N8O
Mol. Mass.400.4365
SMILESNc1ncc(cn1)-c1nc(N2CCOCC2)c2ccc(Nc3ccccn3)cc2n1