Reaction Details
TargetSolute carrier family 13 member 3
LigandBDBM50149244
Substrate/Competitorn/a
Meas. Tech.ChEMBL_1557735 (CHEMBL3773094)
IC50 14100±n/a nM
Citation Huard, KGosset, JRMontgomery, JIGilbert, AHayward, MMMagee, TVCabral, SUccello, DPBahnck, KBrown, JPurkal, JGorgoglione, MLanba, AFutatsugi, KHerr, MGenung, NEAspnes, GPolivkova, JGarcia-Irizarry, CNLi, QCanterbury, DNiosi, MVera, NBLi, ZKhunte, BSiderewicz, JRolph, TErion, DM Optimization of a Dicarboxylic Series for in Vivo Inhibition of Citrate Transport by the Solute Carrier 13 (SLC13) Family. J Med Chem59:1165-75 (2016) 
 
Solute carrier family 13 member 3
Name:Solute carrier family 13 member 3
Type:PROTEIN
Mol. Mass.:66847.40
Organism:Homo sapiens (Human)
Description:ChEMBL_114908
Residue:602
BDBM50149244
NameBDBM50149244
Synonyms:CHEMBL3771118
TypeSmall organic molecule
Emp. Form.C13H17NO6
Mol. Mass.283.2772
SMILESCOc1ncc(C)cc1CC[C@@](O)(CC(O)=O)C(O)=O