Reaction Details
TargetSolute carrier family 13 member 5
LigandBDBM50149289
Substrate/Competitorn/a
Meas. Tech.ChEMBL_1557732 (CHEMBL3773091)
IC50 200±n/a nM
Citation Huard, KGosset, JRMontgomery, JIGilbert, AHayward, MMMagee, TVCabral, SUccello, DPBahnck, KBrown, JPurkal, JGorgoglione, MLanba, AFutatsugi, KHerr, MGenung, NEAspnes, GPolivkova, JGarcia-Irizarry, CNLi, QCanterbury, DNiosi, MVera, NBLi, ZKhunte, BSiderewicz, JRolph, TErion, DM Optimization of a Dicarboxylic Series for in Vivo Inhibition of Citrate Transport by the Solute Carrier 13 (SLC13) Family. J Med Chem59:1165-75 (2016) 
 
Solute carrier family 13 member 5
Name:Solute carrier family 13 member 5
Type:PROTEIN
Mol. Mass.:63069.06
Organism:Homo sapiens (Human)
Description:ChEMBL_116736
Residue:568
BDBM50149289
NameBDBM50149289
Synonyms:CHEMBL3770497
TypeSmall organic molecule
Emp. Form.C14H19NO6
Mol. Mass.297.3038
SMILESCCOc1ncc(C)cc1CCC(O)(CC(O)=O)C(O)=O