Reaction Details
TargetSphingosine 1-phosphate receptor 1
LigandBDBM50149556
Substrate/Competitorn/a
Meas. Tech.ChEMBL_1558238 (CHEMBL3772235)
EC50 20±n/a nM
Citation Demont, EHBailey, JMBit, RABrown, JACampbell, CADeeks, NDowell, SJEldred, CGaskin, PGray, JRHaynes, AHirst, DJHolmes, DSKumar, UMorse, MAOsborne, GJRenaux, JFSeal, GASmethurst, CATaylor, SWatson, RWillis, RWitherington, J Discovery of Tetrahydropyrazolopyridine as Sphingosine 1-Phosphate Receptor 3 (S1P3)-Sparing S1P1 Agonists Active at Low Oral Doses. J Med Chem59:1003-20 (2016) 
 
Sphingosine 1-phosphate receptor 1
Name:Sphingosine 1-phosphate receptor 1
Type:Enzyme
Mol. Mass.:42836.02
Organism:Homo sapiens (Human)
Description:P21453
Residue:382
BDBM50149556
NameBDBM50149556
Synonyms:CHEMBL3770208
TypeSmall organic molecule
Emp. Form.C19H21ClN4O3S
Mol. Mass.420.913
SMILESCC(C)Oc1ccc(cc1Cl)-c1nnc(s1)-n1nc(C)c(CCC(O)=O)c1C