Reaction Details
TargetSphingosine 1-phosphate receptor 3
LigandBDBM50149590
Substrate/Competitorn/a
Meas. Tech.ChEMBL_1558237 (CHEMBL3772234)
EC50<31623±n/a nM
Citation Demont, EHBailey, JMBit, RABrown, JACampbell, CADeeks, NDowell, SJEldred, CGaskin, PGray, JRHaynes, AHirst, DJHolmes, DSKumar, UMorse, MAOsborne, GJRenaux, JFSeal, GASmethurst, CATaylor, SWatson, RWillis, RWitherington, J Discovery of Tetrahydropyrazolopyridine as Sphingosine 1-Phosphate Receptor 3 (S1P3)-Sparing S1P1 Agonists Active at Low Oral Doses. J Med Chem59:1003-20 (2016) 
 
Sphingosine 1-phosphate receptor 3
Name:Sphingosine 1-phosphate receptor 3
Type:G Protein-Coupled Receptor (GPCR)
Mol. Mass.:42278.13
Organism:Homo sapiens (Human)
Description:Q99500
Residue:378
BDBM50149590
NameBDBM50149590
Synonyms:CHEMBL3769703
TypeSmall organic molecule
Emp. Form.C18H19ClN4O3S
Mol. Mass.406.886
SMILESCC(C)Oc1ccc(cc1Cl)-c1nnc(s1)-c1cnn(CCC(O)=O)c1C