Reaction Details
TargetSphingosine 1-phosphate receptor 3
LigandBDBM50149568
Substrate/Competitorn/a
Meas. Tech.ChEMBL_1558237 (CHEMBL3772234)
EC50<31623±n/a nM
Citation Demont, EHBailey, JMBit, RABrown, JACampbell, CADeeks, NDowell, SJEldred, CGaskin, PGray, JRHaynes, AHirst, DJHolmes, DSKumar, UMorse, MAOsborne, GJRenaux, JFSeal, GASmethurst, CATaylor, SWatson, RWillis, RWitherington, J Discovery of Tetrahydropyrazolopyridine as Sphingosine 1-Phosphate Receptor 3 (S1P3)-Sparing S1P1 Agonists Active at Low Oral Doses. J Med Chem59:1003-20 (2016) 
 
Sphingosine 1-phosphate receptor 3
Name:Sphingosine 1-phosphate receptor 3
Type:G Protein-Coupled Receptor (GPCR)
Mol. Mass.:42278.13
Organism:Homo sapiens (Human)
Description:Q99500
Residue:378
BDBM50149568
NameBDBM50149568
Synonyms:CHEMBL3770858
TypeSmall organic molecule
Emp. Form.C22H24N6O3S
Mol. Mass.452.529
SMILESCC(C)Oc1ccc(cc1C#N)-c1nnc(s1)-n1nc2CCN(CCC(O)=O)Cc2c1C