Reaction Details
TargetHistone-lysine N-methyltransferase EZH2
LigandBDBM50149885
Substrate/Competitorn/a
Meas. Tech.ChEMBL_1558364 (CHEMBL3772956)
IC50 2700±n/a nM
Citation Kuntz, KWCampbell, JEKeilhack, HPollock, RMKnutson, SKPorter-Scott, MRichon, VMSneeringer, CJWigle, TJAllain, CJMajer, CRMoyer, MPCopeland, RAChesworth, R The Importance of Being Me: Magic Methyls, Methyltransferase Inhibitors, and the Discovery of Tazemetostat. J Med Chem59:1556-64 (2016) 
 
Histone-lysine N-methyltransferase EZH2
Name:Histone-lysine N-methyltransferase EZH2
Type:Protein
Mol. Mass.:85367.84
Organism:Homo sapiens (Human)
Description:Q15910
Residue:746
BDBM50149885
NameBDBM50149885
Synonyms:CHEMBL3770845
TypeSmall organic molecule
Emp. Form.C17H20ClN3O2
Mol. Mass.333.813
SMILESCNc1cc(Cl)cc(C(=O)NCc2c(C)cc(C)[nH]c2=O)c1C