Reaction Details
TargetHistone-lysine N-methyltransferase EZH2
LigandBDBM50149898
Substrate/Competitorn/a
Meas. Tech.ChEMBL_1558364 (CHEMBL3772956)
IC50 100±n/a nM
Citation Kuntz, KWCampbell, JEKeilhack, HPollock, RMKnutson, SKPorter-Scott, MRichon, VMSneeringer, CJWigle, TJAllain, CJMajer, CRMoyer, MPCopeland, RAChesworth, R The Importance of Being Me: Magic Methyls, Methyltransferase Inhibitors, and the Discovery of Tazemetostat. J Med Chem59:1556-64 (2016) 
 
Histone-lysine N-methyltransferase EZH2
Name:Histone-lysine N-methyltransferase EZH2
Type:Protein
Mol. Mass.:85367.84
Organism:Homo sapiens (Human)
Description:Q15910
Residue:746
BDBM50149898
NameBDBM50149898
Synonyms:CHEMBL3771269
TypeSmall organic molecule
Emp. Form.C22H28ClN3O3
Mol. Mass.417.929
SMILESCCN(C1CCOCC1)c1cc(Cl)cc(C(=O)NCc2c(C)cc[nH]c2=O)c1C