Reaction Details
TargetLysine-specific demethylase 4C
LigandBDBM50149938
Substrate/Competitorn/a
Meas. Tech.ChEBML_1558373
IC50 7943±n/a nM
Citation Westaway, SMPreston, AGBarker, MDBrown, FBrown, JACampbell, MChung, CWDrewes, GEagle, RGarton, NGordon, LHaslam, CHayhow, TGHumphreys, PGJoberty, GKatso, RKruidenier, LLeveridge, MPemberton, MRioja, ISeal, GAShipley, TSingh, OSuckling, CJTaylor, JThomas, PWilson, DMLee, KPrinjha, RK Cell Penetrant Inhibitors of the KDM4 and KDM5 Families of Histone Lysine Demethylases. 2. Pyrido[3,4-d]pyrimidin-4(3H)-one Derivatives. J Med Chem59:1370-87 (2016) 
 
Lysine-specific demethylase 4C
Name:Lysine-specific demethylase 4C
Type:Protein
Mol. Mass.:119979.01
Organism:Homo sapiens (Human)
Description:Q9H3R0
Residue:1056
BDBM50149938
NameBDBM50149938
Synonyms:CHEMBL3770477 | US11472776, Example 6
TypeSmall organic molecule
Emp. Form.C12H8N4O
Mol. Mass.224.2181
SMILESO=c1[nH]c(nc2cnccc12)-c1cccnc1