Reaction Details
TargetLysine-specific demethylase 4C
LigandBDBM50150020
Substrate/Competitorn/a
Meas. Tech.ChEMBL_1558373 (CHEMBL3772965)
IC50<100000±n/a nM
Citation Westaway, SMPreston, AGBarker, MDBrown, FBrown, JACampbell, MChung, CWDrewes, GEagle, RGarton, NGordon, LHaslam, CHayhow, TGHumphreys, PGJoberty, GKatso, RKruidenier, LLeveridge, MPemberton, MRioja, ISeal, GAShipley, TSingh, OSuckling, CJTaylor, JThomas, PWilson, DMLee, KPrinjha, RK Cell Penetrant Inhibitors of the KDM4 and KDM5 Families of Histone Lysine Demethylases. 2. Pyrido[3,4-d]pyrimidin-4(3H)-one Derivatives. J Med Chem59:1370-87 (2016) 
 
Lysine-specific demethylase 4C
Name:Lysine-specific demethylase 4C
Type:Protein
Mol. Mass.:119979.01
Organism:Homo sapiens (Human)
Description:Q9H3R0
Residue:1056
BDBM50150020
NameBDBM50150020
Synonyms:CHEMBL3771310
TypeSmall organic molecule
Emp. Form.C6H5N3O
Mol. Mass.135.1234
SMILESO=c1[nH][nH]c2cnccc12