Reaction Details
TargetLysine-specific demethylase 5C
LigandBDBM50149925
Substrate/Competitorn/a
Meas. Tech.ChEMBL_1558380 (CHEMBL3772972)
IC50 200±n/a nM
Citation Westaway, SMPreston, AGBarker, MDBrown, FBrown, JACampbell, MChung, CWDrewes, GEagle, RGarton, NGordon, LHaslam, CHayhow, TGHumphreys, PGJoberty, GKatso, RKruidenier, LLeveridge, MPemberton, MRioja, ISeal, GAShipley, TSingh, OSuckling, CJTaylor, JThomas, PWilson, DMLee, KPrinjha, RK Cell Penetrant Inhibitors of the KDM4 and KDM5 Families of Histone Lysine Demethylases. 2. Pyrido[3,4-d]pyrimidin-4(3H)-one Derivatives. J Med Chem59:1370-87 (2016) 
 
Lysine-specific demethylase 5C
Name:Lysine-specific demethylase 5C
Type:PROTEIN
Mol. Mass.:175691.17
Organism:Homo sapiens (Human)
Description:P41229
Residue:1560
BDBM50149925
NameBDBM50149925
Synonyms:CHEMBL3770740
TypeSmall organic molecule
Emp. Form.C13H8ClN3O3
Mol. Mass.289.674
SMILESOc1cc(Oc2nc3cnccc3c(=O)[nH]2)ccc1Cl