Reaction Details
TargetdCTP pyrophosphatase 1
LigandBDBM50150039
Substrate/Competitorn/a
Meas. Tech.ChEBML_1558383
IC50 73±n/a nM
Citation Llona-Minguez, SHöglund, AJacques, SAJohansson, LCalderón-Montaño, JMClaesson, MLoseva, OValerie, NCLundbäck, TPiedrafita, JMaga, GCrespan, EMeijer, LBurgos Morón, EBaranczewski, PHagbjörk, ALSvensson, RWiita, EAlmlöf, IVisnes, TJeppsson, FSigmundsson, KJensen, AJArtursson, PJemth, ASStenmark, PWarpman Berglund, UScobie, MHelleday, T Discovery of the First Potent and Selective Inhibitors of Human dCTP Pyrophosphatase 1. J Med Chem59:1140-8 (2016) 
 
dCTP pyrophosphatase 1
Name:dCTP pyrophosphatase 1
Type:Protein
Mol. Mass.:18673.58
Organism:Homo sapiens (Human)
Description:Q9H773
Residue:170
BDBM50150039
NameBDBM50150039
Synonyms:CHEMBL3769653
TypeSmall organic molecule
Emp. Form.C16H11Cl2N3O4
Mol. Mass.380.182
SMILESCc1nc2c(c(Cl)c(Cl)cc2n1Cc1ccc(cc1)C(O)=O)[N+]([O-])=O