Reaction Details
TargetdCTP pyrophosphatase 1
LigandBDBM50150114
Substrate/Competitorn/a
Meas. Tech.ChEMBL_1558383 (CHEMBL3772975)
IC50 74±n/a nM
Citation Llona-Minguez, SHöglund, AJacques, SAJohansson, LCalderón-Montaño, JMClaesson, MLoseva, OValerie, NCLundbäck, TPiedrafita, JMaga, GCrespan, EMeijer, LBurgos Morón, EBaranczewski, PHagbjörk, ALSvensson, RWiita, EAlmlöf, IVisnes, TJeppsson, FSigmundsson, KJensen, AJArtursson, PJemth, ASStenmark, PWarpman Berglund, UScobie, MHelleday, T Discovery of the First Potent and Selective Inhibitors of Human dCTP Pyrophosphatase 1. J Med Chem59:1140-8 (2016) 
 
dCTP pyrophosphatase 1
Name:dCTP pyrophosphatase 1
Type:Protein
Mol. Mass.:18673.58
Organism:Homo sapiens (Human)
Description:Q9H773
Residue:170
BDBM50150114
NameBDBM50150114
Synonyms:CHEMBL3770789
TypeSmall organic molecule
Emp. Form.C14H9Cl2N3O4S
Mol. Mass.386.21
SMILESCc1nc2c(c(Cl)c(Cl)cc2n1S(=O)(=O)c1ccccc1)[N+]([O-])=O